或 与
{{ forum.displayName }}
{{ forum.displayName }}
全部文章   只看精选
至
匹配程度   发表时间
降序   升序
收起
高级搜索
约找到 253 条结果,耗时 0.225 秒
Re:Re:错误 1214 error C2039: “_Type”: 不是“std::tr1::_Result_type2<
腾袭
15年11个月前
回复于软件综合
引用第4楼4king于2011-02-11 21:42发表的 Re:错误 1214 error C2039: “_Type”: 不是“std::tr1::_Result_type2<__formal,_
ANSYS因KB4571756补丁导致无法启动,报错3221227010的解决方法
Ma3.02的守望
6年2个月前
发表于软件综合
一番折腾,执行修复程序,某处发现报错 error:3221227010查询之,解决方法参见:XXXXXXXXXXXXXXXXXXXXXXXXXXXXXXXXXXXXXXXXXXXXXXXXXXXXXXXerror
Re:错误 1214 error C2039: “_Type”: 不是“std::tr1::_Result_type2&lt;__f
腾袭
15年11个月前
回复于软件综合
That's why the compiler error here is so XXXXXXXXXXX fix this, call ::bind() when you want Winsock's
错误 1214 error C2039: “_Type”: 不是“std::tr1::_Result_type2<__formal,_
我说要有光
15年11个月前
发表于软件综合
位于文件 D:\Program Files (x86)\Microsoft Visual Studio 10.0\VC\include\xxresult     第 40 行事情是这样的, 最近在做一...
Re:错误 1214 error C2039: “_Type”: 不是“std::tr1::_Result_type2&lt;__f
我说要有光
15年11个月前
回复于软件综合
控制台片段: 1>c:\\program files\\microsoft visual studio 10.0\\vc\\include\\xxresult(28): error C2825: '_Fty
【开源】HX9500.02扫频仪试验电路图和程序
stm2015
11年7个月前
回复于仪器仪表
compiling main.c... ili9320.c(412): error:  #20: identifier "GPIOD" is undefined ili9320.c(488): error
Re:错误 1214 error C2039: “_Type”: 不是“std::tr1::_Result_type2&lt;__f
4king
15年11个月前
回复于软件综合
哇,我的权限也太低了吧= -
Re:错误 1214 error C2039: “_Type”: 不是“std::tr1::_Result_type2&lt;__f
腾袭
15年11个月前
回复于软件综合
微软的解释: XXXXXXXXXXXXXXXXXXXXXXXXXXXXXXXXXXXXXXXXXXXXXXXXXXXXXXXXXXXXXXXXXXXXXXXXXXXXXXXXXXXXXXXXXXXXX...
Re:错误 1214 error C2039: “_Type”: 不是“std::tr1::_Result_type2&lt;__f
wangcong0755
14年9个月前
回复于软件综合
真的非常感谢楼主,我今天下午遇到一个问题,原来编译的时候没有问题,后来又新添加了一个hpp和cpp文件后就各种报错,说是xxresult里面的28行和40行有错误,我以为是我新添加的文件的问题,看了楼...
STM8单片机制作的3-4V升5V的Boost电路
金坷仙
11年7个月前
回复于电气电工
// int SumError; // } PID;PID Servo_PID;float PIDCalc( PID *pp, float NextPoint ){ int32_t dError,Error
我打算做个kc有史以来最大的金属发动机,大家给点意建
phpskycn
17年8个月前
回复于喷气推进
Error 1[s:2]Can'not find…………Error 2[s:2]You haven't assign type for"Main")
(CPP)MFC应用程序里不能添加自己的类
phpskycn
17年5个月前
回复于软件综合
c:\\william\\visual studio\\cfgs\\cfgs\\cfgsdlg.cpp(67) : error C2143: syntax error : missing ';' before
彩虹之巅的电子开伞,在编译的时候遇到问题
twoone
12年11个月前
回复于喷气推进
included from sketch_feb04a.ino:5: D:\Arduino\libraries\MPU5060/MPU6050_6Axis_MotionApps20.h:133: error
我也造了一台 并联“机械臂”
10班陈大葱22号
15年4个月前
回复于机械与工具
最后一个,最有用的东西就是思想,这里是写坐标解算算法时找到的论文,解算算法都是参考上面的:囧,传完附件弹出提示“FastCGI Error BODY { font: 8pt/12pt verdana }
【开源】HX9500.02扫频仪试验电路图和程序
stm2015
11年7个月前
回复于仪器仪表
compiling main.c... main.c(1): error:  #5: cannot open source input file "stm32f10x_lib.h": No such file
C程序 这个文件指针怎么这么难获得啊?
carneades
16年11个月前
回复于软件综合
C:\\Documents and Settings\\Administrator\\桌面\\fp2.c(6) : error C2059: syntax error : ';'
用SDR接收机接收飞机ADS-B信号并在墙内可用的地图上显示
bywqdq
9年10个月前
回复于无线电
求助,win7 运行dump1090.bat 后出现 Error opening the listening port 8080 (HTTP server): bind: Unknown error 这个错误
上帝啊,我做错了什么
phpskycn
17年5个月前
发表于软件综合
c:\william\visual studio\palette\palette\palette.h(26) : error C2143: syntax error : missing ';' before
会自动发光的安全头盔
bunny9915
12年10个月前
回复于极客DIY
Upload Error: 407 神马意思?
C转CPP的疑问,如何把C写的代码转成CPP写的
玉素甫帖木儿
13年6个月前
回复于软件综合
修改后的……提示:c:\\documents and settings\\计算中心\\桌面\\scp\\scp.cpp(46) : error C2679: binary '<<' : no operator
编程高手进来帮我找下这程序问题出在哪……
acmilan
17年6个月前
回复于软件综合
Compiling...afasdf.cppc:\\program files\\microsoft visual studio\\myprojects\\adasdf\\afasdf.cpp(15) : error
申请科创A基金 - 科技在线图书馆计划SciLib Project
2SC1970
4年7个月前
回复于科创基金
2022.4.14网站无法访问,提示Error 522
oyama
1年2个月前
电文查看详情
不是error,直接上,不管了
【也许有奖】KC 程序邀请赛
93°
17年7个月前
回复于软件综合
没装framework是初始化error吧 = = 不是runtime
多线程同步临界区设置
新奕秀颖
15年7个月前
发表于软件综合
在多线程中,我在全局变量里面定义了CCriticalSection   cs;   想让多线程同步,可是一编译就会出现下面的错误提示: 1,error   C2146:   syntax   error
在我创造的世界里输入一段测试程序
1176764177
12年8个月前
回复于科学技术学
内存溢出~~~ 看门狗到时~~~ sysclk error~~~ 选一个吧。。。 嘎嘎
用SDR接收机接收飞机ADS-B信号并在墙内可用的地图上显示
ry7740kptv
9年10个月前
回复于无线电
引用 bywqdq:求助,win7 运行dump1090.bat 后出现 Error opening the listening port 8080 (HTTP server): bind: Unknown
文件下载
加载中...
{{ errorInfo }}
{{ downloadWarning }}
你在 {{ downloadTime }} 下载过当前文件。
文件名称:{{ resource.defaultFile.name }}
下载次数:{{ resource.hits }}
所需积分:{{ costScores }},{{ holdScores }}下载当前附件免费{{ description }}
积分不足,去充值
文件已丢失

当前账号的附件下载数量限制如下:
时段 个数
{{f.startingTime}}点 - {{f.endTime}}点 {{f.fileCount}}